Reaction Details
TargetDelta-type opioid receptor
LigandBDBM50268466
Substrate/Competitorn/a
Meas. Tech.ChEMBL_523524 (CHEMBL1000646)
Ki 670±n/a nM
Citation Dolle, REMichaut, MMartinez-Teipel, BSeida, PRAjello, CWMuller, ALDeHaven, RNCarroll, PJ Nascent structure-activity relationship study of a diastereomeric series of kappa opioid receptor antagonists derived from CJ-15,208. Bioorg Med Chem Lett19:3647-50 (2009) 
 
Delta-type opioid receptor
Name:Delta-type opioid receptor
Type:G Protein-Coupled Receptor (GPCR)
Mol. Mass.:40382.98
Organism:Homo sapiens (Human)
Description:Competition binding assays were carried out using membrane preparations from transfected HN9.10 cells that constitutively expressed the delta opioid receptor.
Residue:372
BDBM50268466
NameBDBM50268466
Synonyms:CHEMBL510506 | c[L-mTyr-D-pro-L-Phe-D-trp]
TypeSmall organic molecule
Emp. Form.C34H35N5O5
Mol. Mass.593.6722
SMILESOc1cccc(C[C@@H]2NC(=O)[C@@H](Cc3c[nH]c4ccccc34)NC(=O)[C@H](Cc3ccccc3)NC(=O)[C@H]3CCCN3C2=O)c1