Reaction Details
TargetKappa-type opioid receptor
LigandBDBM50268589
Substrate/Competitorn/a
Meas. Tech.ChEMBL_523522 (CHEMBL1000644)
Ki>1000±n/a nM
Citation Dolle, REMichaut, MMartinez-Teipel, BSeida, PRAjello, CWMuller, ALDeHaven, RNCarroll, PJ Nascent structure-activity relationship study of a diastereomeric series of kappa opioid receptor antagonists derived from CJ-15,208. Bioorg Med Chem Lett19:3647-50 (2009) 
 
Kappa-type opioid receptor
Name:Kappa-type opioid receptor
Type:G Protein-Coupled Receptor (GPCR)
Mol. Mass.:42648.76
Organism:Homo sapiens (Human)
Description:P41145
Residue:380
BDBM50268589
NameBDBM50268589
Synonyms:Ac-L-Phe-L-Trp-L-Phe-D-pro-NH2 | CHEMBL499183
TypeSmall organic molecule
Emp. Form.C36H40N6O5
Mol. Mass.636.74
SMILESCC(=O)N[C@@H](Cc1ccccc1)C(=O)N[C@@H](Cc1c[nH]c2ccccc12)C(=O)N[C@@H](Cc1ccccc1)C(=O)N1CCC[C@@H]1C(N)=O