Reaction Details
TargetMu-type opioid receptor
LigandBDBM50378026
Substrate/Competitorn/a
Meas. Tech.ChEMBL_523523 (CHEMBL1000645)
Ki>1000±n/a nM
Citation Dolle, REMichaut, MMartinez-Teipel, BSeida, PRAjello, CWMuller, ALDeHaven, RNCarroll, PJ Nascent structure-activity relationship study of a diastereomeric series of kappa opioid receptor antagonists derived from CJ-15,208. Bioorg Med Chem Lett19:3647-50 (2009) 
 
Mu-type opioid receptor
Name:Mu-type opioid receptor
Type:G Protein-Coupled Receptor (GPCR)
Mol. Mass.:44789.51
Organism:Homo sapiens (Human)
Description:P35372
Residue:400
BDBM50378026
NameBDBM50378026
Synonyms:CHEMBL1169559
TypeSmall organic molecule
Emp. Form.C36H40N6O5
Mol. Mass.636.74
SMILESCC(=O)N[C@@H](Cc1ccccc1)C(=O)N1CCC[C@@H]1C(=O)N[C@@H](Cc1ccccc1)C(=O)N[C@@H](Cc1c[nH]c2ccccc12)C(N)=O