Reaction Details
TargetAdenosine receptor A2b
LigandBDBM50009525
Substrate/Competitorn/a
Meas. Tech.ChEMBL_520203 (CHEMBL951846)
Ki 25500±n/a nM
Citation Borrmann, THinz, SBertarelli, DCLi, WFlorin, NCScheiff, ABMüller, CE 1-alkyl-8-(piperazine-1-sulfonyl)phenylxanthines: development and characterization of adenosine A2B receptor antagonists and a new radioligand with subnanomolar affinity and subtype specificity. J Med Chem52:3994-4006 (2009) 
 
Adenosine receptor A2b
Name:Adenosine receptor A2b
Type:G Protein-Coupled Receptor (GPCR)
Mol. Mass.:36341.22
Organism:Homo sapiens (Human)
Description:n/a
Residue:332
BDBM50009525
NameBDBM50009525
Synonyms:2-CI Adenosine 2-Chloroado CHEMBL285819
TypeSmall organic molecule
Emp. Form.C10H12ClN5O4
Mol. Mass.301.686
SMILESNc1nc(Cl)nc2n(cnc12)[C@@H]1O[C@H](CO)[C@@H](O)[C@H]1O