Reaction Details
TargetAdenosine receptor A2b
LigandBDBM50268108
Substrate/Competitorn/a
Meas. Tech.ChEMBL_520192 (CHEMBL951835)
IC50 4.49±n/a nM
Citation Borrmann, THinz, SBertarelli, DCLi, WFlorin, NCScheiff, ABMüller, CE 1-alkyl-8-(piperazine-1-sulfonyl)phenylxanthines: development and characterization of adenosine A2B receptor antagonists and a new radioligand with subnanomolar affinity and subtype specificity. J Med Chem52:3994-4006 (2009) 
 
Adenosine receptor A2b
Name:Adenosine receptor A2b
Type:G Protein-Coupled Receptor (GPCR)
Mol. Mass.:36341.22
Organism:Homo sapiens (Human)
Description:n/a
Residue:332
BDBM50268108
NameBDBM50268108
Synonyms:8-(4-(4-benzylpiperazin-1-ylsulfonyl)phenyl)-1-ethyl-1H-purine-2,6(3H,7H)-dione | CHEMBL519813
TypeSmall organic molecule
Emp. Form.C24H26N6O4S
Mol. Mass.494.566
SMILESCCn1c(=O)[nH]c2nc([nH]c2c1=O)-c1ccc(cc1)S(=O)(=O)N1CCN(Cc2ccccc2)CC1