Reaction Details
TargetPotassium voltage-gated channel subfamily H member 2
LigandBDBM16179
Substrate/Competitorn/a
Meas. Tech.ChEMBL_545772 (CHEMBL1027667)
IC50 440±n/a nM
Citation Zachariae, UGiordanetto, FLeach, AG Side chain flexibilities in the human ether-a-go-go related gene potassium channel (hERG) together with matched-pair binding studies suggest a new binding mode for channel blockers. J Med Chem52:4266-76 (2009) 
 
Potassium voltage-gated channel subfamily H member 2
Name:Potassium voltage-gated channel subfamily H member 2
Type:Multi-pass membrane protein
Mol. Mass.:126672.65
Organism:Homo sapiens (Human)
Description:Q12809
Residue:1159
BDBM16179
NameBDBM16179
Synonyms:4-{[5-({[(3S)-1-(3-chlorobenzyl)-2-oxopyrrolidin-3-yl]amino}methyl)-1H-imidazol-1-yl]methyl}benzonitrile CHEMBL312137 | MSD-1
TypeSmall organic molecule
Emp. Form.C23H22ClN5O
Mol. Mass.419.907
SMILESClc1cccc(CN2CC[C@H](NCc3cncn3Cc3ccc(cc3)C#N)C2=O)c1