Reaction Details
TargetPotassium voltage-gated channel subfamily H member 2
LigandBDBM50108707
Substrate/Competitorn/a
Meas. Tech.ChEMBL_545772 (CHEMBL1027667)
Ki 1900±n/a nM
Citation Zachariae, UGiordanetto, FLeach, AG Side chain flexibilities in the human ether-a-go-go related gene potassium channel (hERG) together with matched-pair binding studies suggest a new binding mode for channel blockers. J Med Chem52:4266-76 (2009) 
 
Potassium voltage-gated channel subfamily H member 2
Name:Potassium voltage-gated channel subfamily H member 2
Type:Multi-pass membrane protein
Mol. Mass.:126672.65
Organism:Homo sapiens (Human)
Description:Q12809
Residue:1159
BDBM50108707
NameBDBM50108707
Synonyms:3-[[1-(2-(2,4-Difluorophenyl)ethyl)-4-piperidinyl]sulfonyl]benzonitrile CHEMBL147048
TypeSmall organic molecule
Emp. Form.C20H20F2N2O2S
Mol. Mass.390.447
SMILESFc1ccc(CCN2CCC(CC2)S(=O)(=O)c2cccc(c2)C#N)c(F)c1