Reaction Details
TargetKappa-type opioid receptor
LigandBDBM50277470
Substrate/Competitorn/a
Meas. Tech.ChEMBL_502102 (CHEMBL983227)
Ki 0.233±n/a nM
Citation Watanabe, AFujii, HNakajima, MHasebe, KMochizuki, HNagase, H Synthesis of a new opioid ligand having the oxabicyclo[3.2.1]octane skeleton using a new rearrangement reaction. Bioorg Med Chem Lett19:2416-9 (2009) 
 
Kappa-type opioid receptor
Name:Kappa-type opioid receptor
Type:G Protein-Coupled Receptor (GPCR)
Mol. Mass.:42744.99
Organism:Cavia porcellus (domestic guinea pig)
Description:P41144
Residue:380
BDBM50277470
NameBDBM50277470
Synonyms:(1R,9R,10S,13R)-18-(cyclopropylmethyl)-4-hydroxy-19-oxa-18-azapentacyclo[7.6.3.1^{10,13}.0^{1,10}.0^{2,7}]nonadeca-2(7),3,5-trien-14-one | CHEMBL474296
TypeSmall organic molecule
Emp. Form.C21H25NO3
Mol. Mass.339.4281
SMILESOc1ccc2C[C@H]3N(CC4CC4)CC[C@@]4(CC(=O)[C@H]5CC[C@@]34O5)c2c1