Reaction Details
TargetKappa-type opioid receptor
LigandBDBM50277471
Substrate/Competitorn/a
Meas. Tech.ChEMBL_502102 (CHEMBL983227)
Ki 0.102±n/a nM
Citation Watanabe, AFujii, HNakajima, MHasebe, KMochizuki, HNagase, H Synthesis of a new opioid ligand having the oxabicyclo[3.2.1]octane skeleton using a new rearrangement reaction. Bioorg Med Chem Lett19:2416-9 (2009) 
 
Kappa-type opioid receptor
Name:Kappa-type opioid receptor
Type:G Protein-Coupled Receptor (GPCR)
Mol. Mass.:42744.99
Organism:Cavia porcellus (domestic guinea pig)
Description:P41144
Residue:380
BDBM50277471
NameBDBM50277471
Synonyms:(1R,9R,10S,13R)-17-(cyclopropylmethyl)-13-(hydroxymethyl)-18-oxa-17-azapentacyclo[7.5.3.1^{10,13}.0^{1,10}.0^{2,7}]octadeca-2(7),3,5-trien-4-ol | CHEMBL474497
TypeSmall organic molecule
Emp. Form.C21H27NO3
Mol. Mass.341.444
SMILESOC[C@]12CC[C@@]3(O1)[C@H]1Cc4ccc(O)cc4[C@]3(C2)CCN1CC1CC1