Reaction Details
TargetReceptor-type tyrosine-protein kinase FLT3
LigandBDBM50250137
Substrate/Competitorn/a
Meas. Tech.ChEMBL_498300 (CHEMBL972542)
IC50>50000±n/a nM
Citation Hall, MDSalam, NKHellawell, JLFales, HMKensler, CBLudwig, JASzakács, GHibbs, DEGottesman, MM Synthesis, activity, and pharmacophore development for isatin-beta-thiosemicarbazones with selective activity toward multidrug-resistant cells. J Med Chem52:3191-204 (2009) 
 
Receptor-type tyrosine-protein kinase FLT3
Name:Receptor-type tyrosine-protein kinase FLT3
Type:Enzyme
Mol. Mass.:112888.62
Organism:Homo sapiens (Human)
Description:P36888
Residue:993
BDBM50250137
NameBDBM50250137
Synonyms:1-Isatin-4-(4'methoxyphenyl)thiosemicarbazone NSC-73306
TypeSmall organic molecule
Emp. Form.C16H14N4O2S
Mol. Mass.326.373
SMILESCOc1ccc(NC(=S)NN=C2C(=O)Nc3ccccc23)cc1