Reaction Details
TargetRho-associated protein kinase 1
LigandBDBM50250137
Substrate/Competitorn/a
Meas. Tech.ChEMBL_498322 (CHEMBL973460)
IC50>50000±n/a nM
Citation Hall, MDSalam, NKHellawell, JLFales, HMKensler, CBLudwig, JASzakács, GHibbs, DEGottesman, MM Synthesis, activity, and pharmacophore development for isatin-beta-thiosemicarbazones with selective activity toward multidrug-resistant cells. J Med Chem52:3191-204 (2009) 
 
Rho-associated protein kinase 1
Name:Rho-associated protein kinase 1
Type:Serine/threonine-protein kinase
Mol. Mass.:158156.77
Organism:Homo sapiens (Human)
Description:Q13464
Residue:1354
BDBM50250137
NameBDBM50250137
Synonyms:1-Isatin-4-(4'methoxyphenyl)thiosemicarbazone NSC-73306
TypeSmall organic molecule
Emp. Form.C16H14N4O2S
Mol. Mass.326.373
SMILESCOc1ccc(NC(=S)NN=C2C(=O)Nc3ccccc23)cc1