Reaction Details
TargetRibosomal protein S6 kinase alpha-1
LigandBDBM50250137
Substrate/Competitorn/a
Meas. Tech.ChEMBL_498323 (CHEMBL973461)
IC50 34900±n/a nM
Citation Hall, MDSalam, NKHellawell, JLFales, HMKensler, CBLudwig, JASzakács, GHibbs, DEGottesman, MM Synthesis, activity, and pharmacophore development for isatin-beta-thiosemicarbazones with selective activity toward multidrug-resistant cells. J Med Chem52:3191-204 (2009) 
 
Ribosomal protein S6 kinase alpha-1
Name:Ribosomal protein S6 kinase alpha-1
Type:Serine/threonine-protein kinase
Mol. Mass.:82736.10
Organism:Homo sapiens (Human)
Description:n/a
Residue:735
BDBM50250137
NameBDBM50250137
Synonyms:1-Isatin-4-(4'methoxyphenyl)thiosemicarbazone NSC-73306
TypeSmall organic molecule
Emp. Form.C16H14N4O2S
Mol. Mass.326.373
SMILESCOc1ccc(NC(=S)NN=C2C(=O)Nc3ccccc23)cc1