Reaction Details
TargetZinc finger protein GLI1
LigandBDBM50240964
Substrate/Competitorn/a
Meas. Tech.ChEMBL_499799 (CHEMBL972431)
IC50 1800±n/a nM
Citation Mahindroo, NPunchihewa, CFujii, N Hedgehog-Gli signaling pathway inhibitors as anticancer agents. J Med Chem52:3829-45 (2009) 
 
Zinc finger protein GLI1
Name:Zinc finger protein GLI1
Type:PROTEIN
Mol. Mass.:117920.33
Organism:Homo sapiens (Human)
Description:ChEMBL_537531
Residue:1106
BDBM50240964
NameBDBM50240964
Synonyms:11-hydroxy-2,3,8,9-tetrahydro-1H-indolo[2,3-a]pyrrolo[3,4-c]carbazol-1-one CHEMBL190546
TypeSmall organic molecule
Emp. Form.C20H13N3O2
Mol. Mass.327.3361
SMILESOc1ccc2c(c1)[nH]c1c3[nH]c4ccccc4c3c3CNC(=O)c3c21