Reaction Details
TargetZinc finger protein GLI1
LigandBDBM50378034
Substrate/Competitorn/a
Meas. Tech.ChEMBL_499799 (CHEMBL972431)
IC50 620±n/a nM
Citation Mahindroo, NPunchihewa, CFujii, N Hedgehog-Gli signaling pathway inhibitors as anticancer agents. J Med Chem52:3829-45 (2009) 
 
Zinc finger protein GLI1
Name:Zinc finger protein GLI1
Type:PROTEIN
Mol. Mass.:117920.33
Organism:Homo sapiens (Human)
Description:ChEMBL_537531
Residue:1106
BDBM50378034
NameBDBM50378034
Synonyms:CHEMBL504404 PHYSALIN B
TypeSmall organic molecule
Emp. Form.C28H30O9
Mol. Mass.510.5324
SMILESC[C@@]12OC(=O)[C@@]3(O)CC[C@H]4[C@@H](CC=C5CC=CC(=O)[C@]45C)[C@@]45O[C@@]13[C@@H](C4=O)[C@]1(C)C[C@H]2OC(=O)[C@@H]1CO5