Reaction Details
TargetGlucocorticoid receptor
LigandBDBM50249142
Substrate/Competitorn/a
Meas. Tech.ChEMBL_499970 (CHEMBL1019340)
Ki 22.6±n/a nM
Citation Yang, BVVaccaro, WDoweyko, AMDoweyko, LMHuynh, TTortolani, DNadler, SGMcKay, LSomerville, JHolloway, DAHabte, SWeinstein, DSBarrish, JC Discovery of novel dihydro-9,10-ethano-anthracene carboxamides as glucocorticoid receptor modulators. Bioorg Med Chem Lett19:2139-43 (2009) 
 
Glucocorticoid receptor
Name:Glucocorticoid receptor
Type:Enzyme
Mol. Mass.:85656.87
Organism:Homo sapiens (Human)
Description:P04150
Residue:777
BDBM50249142
NameBDBM50249142
Synonyms:CHEMBL514455 | N-(4,5-dimethyl-1,3-thiazol-2-yl)-15-methyltetracyclo[6.6.2.0^{2,7}.0^{9,14}]hexadeca-2,4,6,9(14),10,12-hexaene-15-carboxamide
TypeSmall organic molecule
Emp. Form.C23H22N2OS
Mol. Mass.374.499
SMILESCc1nc(NC(=O)C2(C)CC3c4ccccc4C2c2ccccc32)sc1C