Reaction Details
TargetGlucocorticoid receptor
LigandBDBM50249145
Substrate/Competitorn/a
Meas. Tech.ChEMBL_499970 (CHEMBL1019340)
Ki 82.5±n/a nM
Citation Yang, BVVaccaro, WDoweyko, AMDoweyko, LMHuynh, TTortolani, DNadler, SGMcKay, LSomerville, JHolloway, DAHabte, SWeinstein, DSBarrish, JC Discovery of novel dihydro-9,10-ethano-anthracene carboxamides as glucocorticoid receptor modulators. Bioorg Med Chem Lett19:2139-43 (2009) 
 
Glucocorticoid receptor
Name:Glucocorticoid receptor
Type:Enzyme
Mol. Mass.:85656.87
Organism:Homo sapiens (Human)
Description:P04150
Residue:777
BDBM50249145
NameBDBM50249145
Synonyms:CHEMBL474965 | N,15-dimethyl-N-(1,3-thiazol-2-yl)tetracyclo[6.6.2.0^{2,7}.0^{9,14}]hexadeca-2,4,6,9(14),10,12-hexaene-15-carboxamide
TypeSmall organic molecule
Emp. Form.C22H20N2OS
Mol. Mass.360.472
SMILESCN(C(=O)C1(C)CC2c3ccccc3C1c1ccccc21)c1nccs1