Reaction Details
TargetGlucocorticoid receptor
LigandBDBM50249196
Substrate/Competitorn/a
Meas. Tech.ChEMBL_499970 (CHEMBL1019340)
Ki 0.9±n/a nM
Citation Yang, BVVaccaro, WDoweyko, AMDoweyko, LMHuynh, TTortolani, DNadler, SGMcKay, LSomerville, JHolloway, DAHabte, SWeinstein, DSBarrish, JC Discovery of novel dihydro-9,10-ethano-anthracene carboxamides as glucocorticoid receptor modulators. Bioorg Med Chem Lett19:2139-43 (2009) 
 
Glucocorticoid receptor
Name:Glucocorticoid receptor
Type:Enzyme
Mol. Mass.:85656.87
Organism:Homo sapiens (Human)
Description:P04150
Residue:777
BDBM50249196
NameBDBM50249196
Synonyms:(15R)-8-cyano-15-methyl-N-(1,3-thiazol-2-yl)tetracyclo[6.6.2.0^{2,7}.0^{9,14}]hexadeca-2,4,6,9(14),10,12-hexaene-15-carboxamide | CHEMBL473801
TypeSmall organic molecule
Emp. Form.C22H17N3OS
Mol. Mass.371.455
SMILESC[C@]1(CC2(C#N)c3ccccc3C1c1ccccc21)C(=O)Nc1nccs1