Reaction Details
TargetProgesterone receptor
LigandBDBM50249195
Substrate/Competitorn/a
Meas. Tech.ChEMBL_499977 (CHEMBL1022889)
Ki 35±n/a nM
Citation Yang, BVVaccaro, WDoweyko, AMDoweyko, LMHuynh, TTortolani, DNadler, SGMcKay, LSomerville, JHolloway, DAHabte, SWeinstein, DSBarrish, JC Discovery of novel dihydro-9,10-ethano-anthracene carboxamides as glucocorticoid receptor modulators. Bioorg Med Chem Lett19:2139-43 (2009) 
 
Progesterone receptor
Name:Progesterone receptor
Type:Protein
Mol. Mass.:98979.52
Organism:Homo sapiens (Human)
Description:P06401
Residue:933
BDBM50249195
NameBDBM50249195
Synonyms:8,15-dimethyl-N-(1,3,4-thiadiazol-2-yl)tetracyclo[6.6.2.0^{2,7}.0^{9,14}]hexadeca-2,4,6,9(14),10,12-hexaene-15-carboxamide | CHEMBL514630
TypeSmall organic molecule
Emp. Form.C21H19N3OS
Mol. Mass.361.46
SMILESCC1(CC2(C)c3ccccc3C1c1ccccc21)C(=O)Nc1nncs1