Reaction Details
TargetInsulin-like growth factor 1 receptor
LigandBDBM50293541
Substrate/Competitorn/a
Meas. Tech.ChEMBL_570760 (CHEMBL1026935)
IC50 4±n/a nM
Citation Patnaik, SStevens, KLGerding, RDeanda, FShotwell, JBTang, JHamajima, TNakamura, HLeesnitzer, MAHassell, AMShewchuck, LMKumar, RLei, HChamberlain, SD Discovery of 3,5-disubstituted-1H-pyrrolo[2,3-b]pyridines as potent inhibitors of the insulin-like growth factor-1 receptor (IGF-1R) tyrosine kinase. Bioorg Med Chem Lett19:3136-40 (2009) 
 
Insulin-like growth factor 1 receptor
Name:Insulin-like growth factor 1 receptor
Type:Protein
Mol. Mass.:154776.79
Organism:Homo sapiens (Human)
Description:P08069
Residue:1367
BDBM50293541
NameBDBM50293541
Synonyms:1-(3-(5-(3-((2-(dimethylamino)ethyl)carbamoyl)phenyl)-1H-pyrrolo[2,3-b]pyridin-3-yl)phenyl)-3-(2-phenoxyphenyl)urea | CHEMBL542008
TypeSmall organic molecule
Emp. Form.C37H34N6O3
Mol. Mass.610.7043
SMILESCN(C)CCNC(=O)c1cccc(c1)-c1cnc2[nH]cc(-c3cccc(NC(=O)Nc4ccccc4Oc4ccccc4)c3)c2c1