Reaction Details
TargetGlyoxalase I
LigandBDBM50294134
Substrate/Competitorn/a
Meas. Tech.ChEMBL_571116 (CHEMBL1030416)
Ki 6.17±n/a nM
Citation More, SSVince, R Inhibition of glyoxalase I: the first low-nanomolar tight-binding inhibitors. J Med Chem52:4650-6 (2009) 
 
Glyoxalase I
Name:Glyoxalase I
Type:PROTEIN
Mol. Mass.:37210.98
Organism:Saccharomyces cerevisiae
Description:ChEMBL_571116
Residue:326
BDBM50294134
NameBDBM50294134
Synonyms:(S)-2-Amino-4-{(S)-3-[(4-bromo-phenyl)-hydroxy-carbamoyl]-1-carboxyaminocarbonyl-propylcarbamoyl}-butyric acid TFA | CHEMBL549339
TypeSmall organic molecule
Emp. Form.C18H23BrN4O8
Mol. Mass.503.301
SMILESN[C@@H](CCC(=O)N[C@@H](CCC(=O)N(O)c1ccc(Br)cc1)C(=O)NCC(O)=O)C(O)=O