Reaction Details
TargetGlyoxalase I
LigandBDBM50378037
Substrate/Competitorn/a
Meas. Tech.ChEMBL_571116 (CHEMBL1030416)
Ki 32.6±n/a nM
Citation More, SSVince, R Inhibition of glyoxalase I: the first low-nanomolar tight-binding inhibitors. J Med Chem52:4650-6 (2009) 
 
Glyoxalase I
Name:Glyoxalase I
Type:PROTEIN
Mol. Mass.:37210.98
Organism:Saccharomyces cerevisiae
Description:ChEMBL_571116
Residue:326
BDBM50378037
NameBDBM50378037
Synonyms:CHEMBL1163011
TypeSmall organic molecule
Emp. Form.C17H22BrN5O8
Mol. Mass.504.289
SMILESNC(CNC(=O)NC(CCC(=O)N(O)c1ccc(Br)cc1)C(=O)NCC(O)=O)C(O)=O