Reaction Details
TargetDelta-type opioid receptor
LigandBDBM50294427
Substrate/Competitorn/a
Meas. Tech.ChEMBL_575378 (CHEMBL1027052)
Ki 0.190000±n/a nM
Citation Nagase, HOsa, YNemoto, TFujii, HImai, MNakamura, TKanemasa, TKato, AGouda, HHirono, S Design and synthesis of novel delta opioid receptor agonists and their pharmacologies. Bioorg Med Chem Lett19:2792-5 (2009) 
 
Delta-type opioid receptor
Name:Delta-type opioid receptor
Type:G Protein-Coupled Receptor (GPCR)
Mol. Mass.:40465.04
Organism:Rattus norvegicus (rat)
Description:Competition binding assays were using CHO-K1 cell membranes expressing the opioid receptor.
Residue:372
BDBM50294427
NameBDBM50294427
Synonyms:CHEMBL564538 | SN-23
TypeSmall organic molecule
Emp. Form.C27H30N2O
Mol. Mass.398.5399
SMILESCC(C)CN1CC[C@]23Cc4nc5ccccc5cc4C[C@H]2[C@H]1Cc1ccc(O)cc31