Reaction Details
TargetNitric oxide synthase, inducible
LigandBDBM50295567
Substrate/Competitorn/a
Meas. Tech.ChEMBL_579939 (CHEMBL1056372)
Ki 15000±n/a nM
Citation Bluhm, UBoucher, JLBuss, UClement, BFriedrich, FGirreser, UHeber, DLam, TLepoivre, MRostaie-Gerylow, MWolschendorf, U Synthesis and evaluation of pyrido[1,2-a]pyrimidines as inhibitors of nitric oxide synthases. Eur J Med Chem44:2877-87 (2009) 
 
Nitric oxide synthase, inducible
Name:Nitric oxide synthase, inducible
Type:Enzyme
Mol. Mass.:130595.79
Organism:Mus musculus (mouse)
Description:Recombinant enzyme overexpressed in E. coli.
Residue:1144
BDBM50295567
NameBDBM50295567
Synonyms:3-[4'-(4''-Methoxyphenyl)benzoyl]-3,4-dihydro-8-methyl-2Hpyrido[1,2-a]pyrimidine hydrochloride
TypeSmall organic molecule
Emp. Form.C23H23N2O2
Mol. Mass.359.4404
SMILESCOc1ccc(cc1)-c1ccc(cc1)C(=O)C1CN[c+]2cc(C)ccn2C1