Reaction Details
TargetBeta-2 adrenergic receptor
LigandBDBM25761
Substrate/Competitorn/a
Meas. Tech.ChEMBL_577586 (CHEMBL1058735)
Kd 7.9±n/a nM
Citation Soriano-Ursúa, MAValencia-Hernández, IArellano-Mendoza, MGCorrea-Basurto, JTrujillo-Ferrara, JG Synthesis, pharmacological and in silico evaluation of 1-(4-di-hydroxy-3,5-dioxa-4-borabicyclo[4.4.0]deca-7,9,11-trien-9-yl)-2-(tert-butylamino)ethanol, a compound designed to act as a beta2 adrenoceptor agonist. Eur J Med Chem44:2840-6 (2009) 
 
Beta-2 adrenergic receptor
Name:Beta-2 adrenergic receptor
Type:n/a
Mol. Mass.:46461.69
Organism:Homo sapiens (Human)
Description:P07550
Residue:413
BDBM25761
NameBDBM25761
Synonyms:Anapriline CHEMBL27 PROPRANOLOL, d PROPRANOLOL,(+) Propanolol Propranolol | [2-hydroxy-3-(naphthalen-1-yloxy)propyl](propan-2-yl)amine
TypeSmall organic molecule
Emp. Form.C16H21NO2
Mol. Mass.259.3434
SMILESCC(C)NCC(O)COc1cccc2ccccc12