Reaction Details
TargetCannabinoid receptor 1
LigandBDBM50296144
Substrate/Competitorn/a
Meas. Tech.ChEMBL_579535 (CHEMBL1059682)
EC50 1200±n/a nM
Citation Foloppe, NBenwell, KBrooks, TDKennett, GKnight, ARMisra, AMonck, NJ Discovery and functional evaluation of diverse novel human CB(1) receptor ligands. Bioorg Med Chem Lett19:4183-90 (2009) 
 
Cannabinoid receptor 1
Name:Cannabinoid receptor 1
Type:G Protein-Coupled Receptor (GPCR)
Mol. Mass.:52868.96
Organism:Homo sapiens (Human)
Description:P21554
Residue:472
BDBM50296144
NameBDBM50296144
Synonyms:2-(7,7-dimethyl-2-p-tolyl-7,8-dihydro-5H-pyrano[4,3-d]pyrimidin-4-ylthio)-N-(2-methoxyphenyl)propanamide | CHEMBL560463
TypeSmall organic molecule
Emp. Form.C26H29N3O3S
Mol. Mass.463.592
SMILESCOc1ccccc1NC(=O)C(C)Sc1nc(nc2CC(C)(C)OCc12)-c1ccc(C)cc1