Reaction Details
TargetCannabinoid receptor 1
LigandBDBM50296151
Substrate/Competitorn/a
Meas. Tech.ChEMBL_579533 (CHEMBL1059680)
Ki 611±n/a nM
Citation Foloppe, NBenwell, KBrooks, TDKennett, GKnight, ARMisra, AMonck, NJ Discovery and functional evaluation of diverse novel human CB(1) receptor ligands. Bioorg Med Chem Lett19:4183-90 (2009) 
 
Cannabinoid receptor 1
Name:Cannabinoid receptor 1
Type:G Protein-Coupled Receptor (GPCR)
Mol. Mass.:52868.96
Organism:Homo sapiens (Human)
Description:P21554
Residue:472
BDBM50296151
NameBDBM50296151
Synonyms:CHEMBL559035 | N-benzhydryl-5-(3,5-dimethylpiperidin-1-ylsulfonyl)-2-fluorobenzamide
TypeSmall organic molecule
Emp. Form.C27H29FN2O3S
Mol. Mass.480.594
SMILESCC1CC(C)CN(C1)S(=O)(=O)c1ccc(F)c(c1)C(=O)NC(c1ccccc1)c1ccccc1