Reaction Details
TargetCannabinoid receptor 1
LigandBDBM50296152
Substrate/Competitorn/a
Meas. Tech.ChEMBL_579533 (CHEMBL1059680)
Ki 875±n/a nM
Citation Foloppe, NBenwell, KBrooks, TDKennett, GKnight, ARMisra, AMonck, NJ Discovery and functional evaluation of diverse novel human CB(1) receptor ligands. Bioorg Med Chem Lett19:4183-90 (2009) 
 
Cannabinoid receptor 1
Name:Cannabinoid receptor 1
Type:G Protein-Coupled Receptor (GPCR)
Mol. Mass.:52868.96
Organism:Homo sapiens (Human)
Description:P21554
Residue:472
BDBM50296152
NameBDBM50296152
Synonyms:CHEMBL562123 | N-(2-(4-(4-fluorophenyl)-6,7-dihydrothieno[3,2-c]pyridin-5(4H)-yl)-2-oxoethyl)-N-isobutylfuran-2-carboxamide
TypeSmall organic molecule
Emp. Form.C24H25FN2O3S
Mol. Mass.440.53
SMILESCC(C)CN(CC(=O)N1CCc2sccc2C1c1ccc(F)cc1)C(=O)c1ccco1