Reaction Details
TargetCannabinoid receptor 1
LigandBDBM50296156
Substrate/Competitorn/a
Meas. Tech.ChEMBL_579533 (CHEMBL1059680)
Ki 1177±n/a nM
Citation Foloppe, NBenwell, KBrooks, TDKennett, GKnight, ARMisra, AMonck, NJ Discovery and functional evaluation of diverse novel human CB(1) receptor ligands. Bioorg Med Chem Lett19:4183-90 (2009) 
 
Cannabinoid receptor 1
Name:Cannabinoid receptor 1
Type:G Protein-Coupled Receptor (GPCR)
Mol. Mass.:52868.96
Organism:Homo sapiens (Human)
Description:P21554
Residue:472
BDBM50296156
NameBDBM50296156
Synonyms:CHEMBL551122 | N-benzhydryl-6-(2,6-dimethylmorpholino)-5-nitropyrimidin-4-amine
TypeSmall organic molecule
Emp. Form.C23H25N5O3
Mol. Mass.419.4763
SMILESCC1CN(CC(C)O1)c1ncnc(NC(c2ccccc2)c2ccccc2)c1[N+]([O-])=O