Reaction Details
TargetCannabinoid receptor 1
LigandBDBM50296160
Substrate/Competitorn/a
Meas. Tech.ChEMBL_579533 (CHEMBL1059680)
Ki 1943±n/a nM
Citation Foloppe, NBenwell, KBrooks, TDKennett, GKnight, ARMisra, AMonck, NJ Discovery and functional evaluation of diverse novel human CB(1) receptor ligands. Bioorg Med Chem Lett19:4183-90 (2009) 
 
Cannabinoid receptor 1
Name:Cannabinoid receptor 1
Type:G Protein-Coupled Receptor (GPCR)
Mol. Mass.:52868.96
Organism:Homo sapiens (Human)
Description:P21554
Residue:472
BDBM50296160
NameBDBM50296160
Synonyms:1-(4-(3-(2,4-dimethoxyphenyl)-1-m-tolyl-1H-pyrazole-5-carbonyl)piperazin-1-yl)ethanone | CHEMBL556422
TypeSmall organic molecule
Emp. Form.C25H28N4O4
Mol. Mass.448.5142
SMILESCOc1ccc(-c2cc(C(=O)N3CCN(CC3)C(C)=O)n(n2)-c2cccc(C)c2)c(OC)c1