Reaction Details
TargetCannabinoid receptor 1
LigandBDBM50296148
Substrate/Competitorn/a
Meas. Tech.ChEMBL_579535 (CHEMBL1059682)
EC50 400±n/a nM
Citation Foloppe, NBenwell, KBrooks, TDKennett, GKnight, ARMisra, AMonck, NJ Discovery and functional evaluation of diverse novel human CB(1) receptor ligands. Bioorg Med Chem Lett19:4183-90 (2009) 
 
Cannabinoid receptor 1
Name:Cannabinoid receptor 1
Type:G Protein-Coupled Receptor (GPCR)
Mol. Mass.:52868.96
Organism:Homo sapiens (Human)
Description:P21554
Residue:472
BDBM50296148
NameBDBM50296148
Synonyms:2-[2-(2,4,6-Trimethyl-phenoxy)-acetylamino]-4,5,6,7-tetrahydro-benzo[b]thiophene-3-carboxylic acid (1,1-dioxo-tetrahydro-1lambda*6*-thiophen-3-yl)-amide | CHEMBL560383
TypeSmall organic molecule
Emp. Form.C24H30N2O5S2
Mol. Mass.490.635
SMILESCc1cc(C)c(OCC(=O)Nc2sc3CCCCc3c2C(=O)NC2CCS(=O)(=O)C2)c(C)c1