Reaction Details
TargetCannabinoid receptor 1
LigandBDBM50296149
Substrate/Competitorn/a
Meas. Tech.ChEMBL_579535 (CHEMBL1059682)
EC50 1100±n/a nM
Citation Foloppe, NBenwell, KBrooks, TDKennett, GKnight, ARMisra, AMonck, NJ Discovery and functional evaluation of diverse novel human CB(1) receptor ligands. Bioorg Med Chem Lett19:4183-90 (2009) 
 
Cannabinoid receptor 1
Name:Cannabinoid receptor 1
Type:G Protein-Coupled Receptor (GPCR)
Mol. Mass.:52868.96
Organism:Homo sapiens (Human)
Description:P21554
Residue:472
BDBM50296149
NameBDBM50296149
Synonyms:CHEMBL550309 | N-cyclopropyl-N-(2-oxo-2-(4-p-tolylpyrrolo[1,2-a]quinoxalin-5(4H)-yl)ethyl)cyclopentanecarboxamide
TypeSmall organic molecule
Emp. Form.C29H31N3O2
Mol. Mass.453.5753
SMILESCc1ccc(cc1)C1N(C(=O)CN(C2CC2)C(=O)C2CCCC2)c2ccccc2-n2cccc12