Reaction Details
TargetCannabinoid receptor 2
LigandBDBM50296142
Substrate/Competitorn/a
Meas. Tech.ChEMBL_579534 (CHEMBL1059681)
Ki 3919±n/a nM
Citation Foloppe, NBenwell, KBrooks, TDKennett, GKnight, ARMisra, AMonck, NJ Discovery and functional evaluation of diverse novel human CB(1) receptor ligands. Bioorg Med Chem Lett19:4183-90 (2009) 
 
Cannabinoid receptor 2
Name:Cannabinoid receptor 2
Type:G Protein-Coupled Receptor (GPCR)
Mol. Mass.:39690.94
Organism:Homo sapiens (Human)
Description:P34972
Residue:360
BDBM50296142
NameBDBM50296142
Synonyms:1-(1-(4-chlorophenyl)-4-(3-methoxyphenyl)-5-(4-morpholinophenyl)-4,5-dihydro-1H-1,2,4-triazol-3-yl)ethanone | CHEMBL554943
TypeSmall organic molecule
Emp. Form.C27H27ClN4O3
Mol. Mass.490.981
SMILESCOc1cccc(c1)N1C(N(N=C1C(C)=O)c1ccc(Cl)cc1)c1ccc(cc1)N1CCOCC1