Reaction Details
TargetDelta-type opioid receptor
LigandBDBM50296866
Substrate/Competitorn/a
Meas. Tech.ChEMBL_580496 (CHEMBL1052523)
Ki 1120±n/a nM
Citation Li, FGaob, LYin, CChen, JLiu, JXie, XZhang, A Synthesis and opioid receptor activity of indolopropellanes. Bioorg Med Chem Lett19:4603-6 (2009) 
 
Delta-type opioid receptor
Name:Delta-type opioid receptor
Type:G Protein-Coupled Receptor (GPCR)
Mol. Mass.:40382.98
Organism:Homo sapiens (Human)
Description:Competition binding assays were carried out using membrane preparations from transfected HN9.10 cells that constitutively expressed the delta opioid receptor.
Residue:372
BDBM50296866
NameBDBM50296866
Synonyms:(1S,13R)-22-methyl-10,22-diazahexacyclo[11.7.4.0^{1,13}.0^{3,11}.0^{4,9}.0^{14,19}]tetracosa-3(11),4(9),5,7,14(19),15,17-heptaen-16-ol | CHEMBL562139
TypeSmall organic molecule
Emp. Form.C23H24N2O
Mol. Mass.344.4495
SMILESCN1CC[C@]23Cc4[nH]c5ccccc5c4C[C@]2(Cc2ccc(O)cc32)C1