Reaction Details
TargetDelta-type opioid receptor
LigandBDBM50296868
Substrate/Competitorn/a
Meas. Tech.ChEMBL_580496 (CHEMBL1052523)
Ki 2550±n/a nM
Citation Li, FGaob, LYin, CChen, JLiu, JXie, XZhang, A Synthesis and opioid receptor activity of indolopropellanes. Bioorg Med Chem Lett19:4603-6 (2009) 
 
Delta-type opioid receptor
Name:Delta-type opioid receptor
Type:G Protein-Coupled Receptor (GPCR)
Mol. Mass.:40382.98
Organism:Homo sapiens (Human)
Description:Competition binding assays were carried out using membrane preparations from transfected HN9.10 cells that constitutively expressed the delta opioid receptor.
Residue:372
BDBM50296868
NameBDBM50296868
Synonyms:(1S,13R)-22-(cyclopropylmethyl)-10,22-diazahexacyclo[11.7.4.0^{1,13}.0^{3,11}.0^{4,9}.0^{14,19}]tetracosa-3(11),4(9),5,7,14(19),15,17-heptaen-16-ol | CHEMBL562340
TypeSmall organic molecule
Emp. Form.C26H28N2O
Mol. Mass.384.5133
SMILESOc1ccc2C[C@@]34CN(CC5CC5)CC[C@@]3(Cc3[nH]c5ccccc5c3C4)c2c1