Reaction Details
TargetMu-type opioid receptor
LigandBDBM50296869
Substrate/Competitorn/a
Meas. Tech.ChEMBL_580497 (CHEMBL1052524)
Ki 469±n/a nM
Citation Li, FGaob, LYin, CChen, JLiu, JXie, XZhang, A Synthesis and opioid receptor activity of indolopropellanes. Bioorg Med Chem Lett19:4603-6 (2009) 
 
Mu-type opioid receptor
Name:Mu-type opioid receptor
Type:G Protein-Coupled Receptor (GPCR)
Mol. Mass.:44789.51
Organism:Homo sapiens (Human)
Description:P35372
Residue:400
BDBM50296869
NameBDBM50296869
Synonyms:(1S,13R)-22-(cyclopropylmethyl)-10-methyl-10,22-diazahexacyclo[11.7.4.0^{1,13}.0^{3,11}.0^{4,9}.0^{14,19}]tetracosa-3(11),4(9),5,7,14(19),15,17-heptaen-16-ol | CHEMBL558135
TypeSmall organic molecule
Emp. Form.C27H30N2O
Mol. Mass.398.5399
SMILESCn1c2C[C@@]34CCN(CC5CC5)C[C@@]3(Cc3ccc(O)cc43)Cc2c2ccccc12