Reaction Details
TargetMyosin light chain kinase, smooth muscle
LigandBDBM15210
Substrate/Competitorn/a
Meas. Tech.ChEMBL_587164 (CHEMBL1060228)
Ki 68000±n/a nM
Citation Engh, RAGirod, AKinzel, VHuber, RBossemeyer, D Crystal structures of catalytic subunit of cAMP-dependent protein kinase in complex with isoquinolinesulfonyl protein kinase inhibitors H7, H8, and H89. Structural implications for selectivity. J Biol Chem271:26157-64 (1996) Myosin light chain kinase, smooth muscle
Name:Myosin light chain kinase, smooth muscle
Type:Enzyme
Mol. Mass.:210423.57
Organism:Gallus gallus (chicken)
Description:n/a
Residue:1906
BDBM15210
NameBDBM15210
Synonyms:CHEMBL148333 Lopac-M-9656 N-[2-(methylamino)ethyl]isoquinoline-5-sulfonamide
TypeSmall organic molecule
Emp. Form.C12H15N3O2S
Mol. Mass.265.331
SMILESCNCCNS(=O)(=O)c1cccc2cnccc12