Reaction Details
TargetCalcium/calmodulin-dependent protein kinase kinase 2
LigandBDBM92455
Substrate/Competitorn/a
Meas. Tech.ChEMBL_586499 (CHEMBL1051267)
IC50 10±n/a nM
Citation Bain, JPlater, LElliott, MShpiro, NHastie, CJMcLauchlan, HKlevernic, IArthur, JSAlessi, DRCohen, P The selectivity of protein kinase inhibitors: a further update. Biochem J408:297-315 (2007) 
 
Calcium/calmodulin-dependent protein kinase kinase 2
Name:Calcium/calmodulin-dependent protein kinase kinase 2
Type:Enzyme Catalytic Domain
Mol. Mass.:64746.61
Organism:Homo sapiens (Human)
Description:gi_27437015
Residue:588
BDBM92455
NameBDBM92455
Synonyms:CHEMBL265470 | STO-609
TypeSmall organic molecule
Emp. Form.C19H10N2O3
Mol. Mass.314.2943
SMILESOC(=O)c1ccc2c3nc4ccccc4n3c(=O)c3cccc1c23