Reaction Details
TargetSerine/threonine-protein kinase B-raf
LigandBDBM50153835
Substrate/Competitorn/a
Meas. Tech.ChEMBL_586614 (CHEMBL1061192)
IC50 230±n/a nM
Citation Bain, JPlater, LElliott, MShpiro, NHastie, CJMcLauchlan, HKlevernic, IArthur, JSAlessi, DRCohen, P The selectivity of protein kinase inhibitors: a further update. Biochem J408:297-315 (2007) 
 
Serine/threonine-protein kinase B-raf
Name:Serine/threonine-protein kinase B-raf
Type:Serine/threonine-protein kinase
Mol. Mass.:84446.00
Organism:Homo sapiens (Human)
Description:P15056
Residue:766
BDBM50153835
NameBDBM50153835
Synonyms:1-(3-dimethylaminophenylcarboxamido)-3-(4-hydroxyphenylcarboxamido)-4-methylbenzene CHEMBL186526 ZM-336372
TypeSmall organic molecule
Emp. Form.C23H23N3O3
Mol. Mass.389.447
SMILESCN(C)c1cccc(c1)C(=O)Nc1ccc(C)c(NC(=O)c2ccc(O)cc2)c1