Reaction Details
TargetMAP kinase-interacting serine/threonine-protein kinase 1
LigandBDBM92455
Substrate/Competitorn/a
Meas. Tech.ChEMBL_587003 (CHEMBL1062792)
IC50 120±n/a nM
Citation Bain, JPlater, LElliott, MShpiro, NHastie, CJMcLauchlan, HKlevernic, IArthur, JSAlessi, DRCohen, P The selectivity of protein kinase inhibitors: a further update. Biochem J408:297-315 (2007) 
 
MAP kinase-interacting serine/threonine-protein kinase 1
Name:MAP kinase-interacting serine/threonine-protein kinase 1
Type:Serine/threonine-protein kinase
Mol. Mass.:51342.85
Organism:Homo sapiens (Human)
Description:Q9BUB5
Residue:465
BDBM92455
NameBDBM92455
Synonyms:CHEMBL265470 | STO-609
TypeSmall organic molecule
Emp. Form.C19H10N2O3
Mol. Mass.314.2943
SMILESOC(=O)c1ccc2c3nc4ccccc4n3c(=O)c3cccc1c23