Reaction Details
TargetSerine/threonine-protein kinase pim-1
LigandBDBM50358043
Substrate/Competitorn/a
Meas. Tech.ChEMBL_586377 (CHEMBL1061942)
IC50 170±n/a nM
Citation Bain, JPlater, LElliott, MShpiro, NHastie, CJMcLauchlan, HKlevernic, IArthur, JSAlessi, DRCohen, P The selectivity of protein kinase inhibitors: a further update. Biochem J408:297-315 (2007) 
 
Serine/threonine-protein kinase pim-1
Name:Serine/threonine-protein kinase pim-1
Type:Protein
Mol. Mass.:35681.82
Organism:Homo sapiens (Human)
Description:P11309
Residue:313
BDBM50358043
NameBDBM50358043
Synonyms:CHEMBL1794051 | GW-5074
TypeSmall organic molecule
Emp. Form.C15H10Br2INO2
Mol. Mass.522.958
SMILESOC1Nc2ccc(I)cc2C1=Cc1cc(Br)c(O)c(Br)c1