Reaction Details
TargetProto-oncogene tyrosine-protein kinase LCK
LigandBDBM50298223
Substrate/Competitorn/a
Meas. Tech.ChEMBL_587115 (CHEMBL1051325)
IC50 2500±n/a nM
Citation Bain, JPlater, LElliott, MShpiro, NHastie, CJMcLauchlan, HKlevernic, IArthur, JSAlessi, DRCohen, P The selectivity of protein kinase inhibitors: a further update. Biochem J408:297-315 (2007) 
 
Proto-oncogene tyrosine-protein kinase LCK
Name:Proto-oncogene tyrosine-protein kinase LCK
Type:PROTEIN
Mol. Mass.:57927.84
Organism:Mus musculus
Description:ChEMBL_806408
Residue:509
BDBM50298223
NameBDBM50298223
Synonyms:CGP-57380 CHEMBL576817 | N-(4-fluorophenyl)-3H-pyrazolo[3,4-d]pyrimidine-3,4-diamine
TypeSmall organic molecule
Emp. Form.C11H9FN6
Mol. Mass.244.2278
SMILESNc1ncnc2n[nH]c(Nc3ccc(F)cc3)c12