Reaction Details
TargetCalcium/calmodulin-dependent protein kinase kinase 1
LigandBDBM92455
Substrate/Competitorn/a
Meas. Tech.ChEMBL_587113 (CHEMBL1051323)
IC50 120±n/a nM
Citation Bain, JPlater, LElliott, MShpiro, NHastie, CJMcLauchlan, HKlevernic, IArthur, JSAlessi, DRCohen, P The selectivity of protein kinase inhibitors: a further update. Biochem J408:297-315 (2007) 
 
Calcium/calmodulin-dependent protein kinase kinase 1
Name:Calcium/calmodulin-dependent protein kinase kinase 1
Type:PROTEIN
Mol. Mass.:55727.76
Organism:Homo sapiens (Human)
Description:ChEMBL_774623
Residue:505
BDBM92455
NameBDBM92455
Synonyms:CHEMBL265470 | STO-609
TypeSmall organic molecule
Emp. Form.C19H10N2O3
Mol. Mass.314.2943
SMILESOC(=O)c1ccc2c3nc4ccccc4n3c(=O)c3cccc1c23