Reaction Details
TargetSerine/threonine-protein kinase pim-3
LigandBDBM50358043
Substrate/Competitorn/a
Meas. Tech.ChEMBL_586743 (CHEMBL1062887)
IC50 100±n/a nM
Citation Bain, JPlater, LElliott, MShpiro, NHastie, CJMcLauchlan, HKlevernic, IArthur, JSAlessi, DRCohen, P The selectivity of protein kinase inhibitors: a further update. Biochem J408:297-315 (2007) 
 
Serine/threonine-protein kinase pim-3
Name:Serine/threonine-protein kinase pim-3
Type:Protein
Mol. Mass.:35888.19
Organism:Homo sapiens (Human)
Description:Q86V86
Residue:326
BDBM50358043
NameBDBM50358043
Synonyms:CHEMBL1794051 | GW-5074
TypeSmall organic molecule
Emp. Form.C15H10Br2INO2
Mol. Mass.522.958
SMILESOC1Nc2ccc(I)cc2C1=Cc1cc(Br)c(O)c(Br)c1