Reaction Details
TargetSerine/threonine-protein kinase D1
LigandBDBM50229961
Substrate/Competitorn/a
Meas. Tech.ChEMBL_586502 (CHEMBL1051270)
IC50 900±n/a nM
Citation Bain, JPlater, LElliott, MShpiro, NHastie, CJMcLauchlan, HKlevernic, IArthur, JSAlessi, DRCohen, P The selectivity of protein kinase inhibitors: a further update. Biochem J408:297-315 (2007) 
 
Serine/threonine-protein kinase D1
Name:Serine/threonine-protein kinase D1
Type:Serine/threonine-protein kinase
Mol. Mass.:101705.07
Organism:Homo sapiens (Human)
Description:gi_115529463
Residue:912
BDBM50229961
NameBDBM50229961
Synonyms:1-(1,1-dimethylethyl)-3-(1-naphthalenyl)-1H-pyrazolo[3,4-d]pyrimidin-4-amine 1-NA-PP1 1-tert-butyl-3-naphthalen-1-yl-1H-pyrazolo[3,4-d]pyrimidin-4-amine CHEMBL264406 US11247972, Compound 1 | US9765037, Compound 1
TypeSmall organic molecule
Emp. Form.C19H19N5
Mol. Mass.317.3877
SMILESCC(C)(C)n1nc(-c2cccc3ccccc23)c2c(N)ncnc12