Reaction Details
TargetSodium-dependent serotonin transporter
LigandBDBM50302917
Substrate/Competitorn/a
Meas. Tech.ChEMBL_595696 (CHEMBL1041759)
Ki 2100±n/a nM
Citation Carroll, FIBlough, BEAbraham, PMills, ACHolleman, JAWolckenhauer, SADecker, AMLandavazo, AMcElroy, KTNavarro, HAGatch, MBForster, MJ Synthesis and biological evaluation of bupropion analogues as potential pharmacotherapies for cocaine addiction. J Med Chem52:6768-81 (2009) 
 
Sodium-dependent serotonin transporter
Name:Sodium-dependent serotonin transporter
Type:Multi-pass membrane protein
Mol. Mass.:70322.51
Organism:Homo sapiens (Human)
Description:P31645
Residue:630
BDBM50302917
NameBDBM50302917
Synonyms:2-(N-tert-Butylamino)-3'-chloro-4'-methylpropiophenone CHEMBL565844
TypeSmall organic molecule
Emp. Form.C14H20ClNO
Mol. Mass.253.768
SMILESCC(NC(C)(C)C)C(=O)c1ccc(C)c(Cl)c1