Reaction Details
TargetSodium-dependent dopamine transporter
LigandBDBM50302923
Substrate/Competitorn/a
Meas. Tech.ChEMBL_595695 (CHEMBL1041758)
Ki 1700±n/a nM
Citation Carroll, FIBlough, BEAbraham, PMills, ACHolleman, JAWolckenhauer, SADecker, AMLandavazo, AMcElroy, KTNavarro, HAGatch, MBForster, MJ Synthesis and biological evaluation of bupropion analogues as potential pharmacotherapies for cocaine addiction. J Med Chem52:6768-81 (2009) 
 
Sodium-dependent dopamine transporter
Name:Sodium-dependent dopamine transporter
Type:Multi-pass membrane protein
Mol. Mass.:68497.11
Organism:Homo sapiens (Human)
Description:Q01959
Residue:620
BDBM50302923
NameBDBM50302923
Synonyms:2-(N-tert-Butylamino)-3'-chlorophenyl-4-cyclohexylbutanophenone | CHEMBL567479
TypeSmall organic molecule
Emp. Form.C20H30ClNO
Mol. Mass.335.911
SMILESCC(C)(C)NC(CCC1CCCCC1)C(=O)c1cccc(Cl)c1