Reaction Details
TargetSodium-dependent dopamine transporter
LigandBDBM50302907
Substrate/Competitorn/a
Meas. Tech.ChEMBL_595695 (CHEMBL1041758)
Ki 1150±n/a nM
Citation Carroll, FIBlough, BEAbraham, PMills, ACHolleman, JAWolckenhauer, SADecker, AMLandavazo, AMcElroy, KTNavarro, HAGatch, MBForster, MJ Synthesis and biological evaluation of bupropion analogues as potential pharmacotherapies for cocaine addiction. J Med Chem52:6768-81 (2009) 
 
Sodium-dependent dopamine transporter
Name:Sodium-dependent dopamine transporter
Type:Multi-pass membrane protein
Mol. Mass.:68497.11
Organism:Homo sapiens (Human)
Description:Q01959
Residue:620
BDBM50302907
NameBDBM50302907
Synonyms:2-(N-Cyclopropylamino)-3-chloropropiophenone | CHEMBL569700
TypeSmall organic molecule
Emp. Form.C12H14ClNO
Mol. Mass.223.699
SMILESCC(NC1CC1)C(=O)c1cccc(Cl)c1