Reaction Details
TargetSodium-dependent dopamine transporter
LigandBDBM50302908
Substrate/Competitorn/a
Meas. Tech.ChEMBL_595695 (CHEMBL1041758)
Ki 4133±n/a nM
Citation Carroll, FIBlough, BEAbraham, PMills, ACHolleman, JAWolckenhauer, SADecker, AMLandavazo, AMcElroy, KTNavarro, HAGatch, MBForster, MJ Synthesis and biological evaluation of bupropion analogues as potential pharmacotherapies for cocaine addiction. J Med Chem52:6768-81 (2009) 
 
Sodium-dependent dopamine transporter
Name:Sodium-dependent dopamine transporter
Type:Multi-pass membrane protein
Mol. Mass.:68497.11
Organism:Homo sapiens (Human)
Description:Q01959
Residue:620
BDBM50302908
NameBDBM50302908
Synonyms:1-(3-chlorophenyl)-2-(dimethylamino)propan-1-one CHEMBL566830
TypeSmall organic molecule
Emp. Form.C11H14ClNO
Mol. Mass.211.688
SMILESCC(N(C)C)C(=O)c1cccc(Cl)c1