Reaction Details
TargetGlycogen phosphorylase, muscle form
LigandBDBM50346702
Substrate/Competitorn/a
Meas. Tech.ChEMBL_587471 (CHEMBL1042192)
IC50 1100±n/a nM
Citation Cheng, KZhang, PLiu, JXie, JSun, H Practical synthesis of bredemolic acid, a natural inhibitor of glycogen phosphorylase. J Nat Prod71:1877-80 (2011) 
 
Glycogen phosphorylase, muscle form
Name:Glycogen phosphorylase, muscle form
Type:Enzyme
Mol. Mass.:97296.32
Organism:Oryctolagus cuniculus (rabbit)
Description:Phosphorylation of Ser-15 converts phosphorylase B (unphosphorylated) to phosphorylase A.
Residue:843
BDBM50346702
NameBDBM50346702
Synonyms:CHEMBL574993
TypeSmall organic molecule
Emp. Form.C30H48O4
Mol. Mass.472.6997
SMILESC[C@@H]1CC[C@@]2(CC[C@]3(C)C(=CC[C@@H]4[C@@]5(C)C[C@H](O)[C@@H](O)C(C)(C)[C@@H]5CC[C@@]34C)[C@@H]2[C@H]1C)C(O)=O