Reaction Details
TargetCarbonic anhydrase 1
LigandBDBM10881
Substrate/Competitorn/a
Meas. Tech.ChEMBL_587741 (CHEMBL1038577)
Ki 50±n/a nM
Citation Bertucci, AInnocenti, AZoccola, DScozzafava, ATambutté, SSupuran, CT Carbonic anhydrase inhibitors. Inhibition studies of a coral secretory isoform by sulfonamides. Bioorg Med Chem17:5054-8 (2009) 
 
Carbonic anhydrase 1
Name:Carbonic anhydrase 1
Type:Enzyme
Mol. Mass.:28873.37
Organism:Homo sapiens (Human)
Description:P00915
Residue:261
BDBM10881
NameBDBM10881
Synonyms:CHEMBL288100 Methazolamide Methazolamide, MZA Sulfonamide, 2 sulfonamide 2
TypeSmall organic molecule
Emp. Form.C5H8N4O3S2
Mol. Mass.236.272
SMILESCC(=O)N=c1sc(nn1C)S(N)(=O)=O